{"text_format":"1","workbook":"xlsx","n_sheets":3,"sheets":["Auswahl Zukunftsbetrag","Datenbasis1","Hilfsvariablen"],"not_rendered":{"charts":0,"images":1,"macros":1,"external_links":0,"defined_names":71,"comments":0,"pivot_tables":0},"unopened":[],"bounds":{"document_bytes":16777216,"sheet_cells":100000,"rows_first":2000,"rows_last":500,"rows_between":2000,"halvings":0,"cell_chars":16384,"cell_head_chars":4096},"cells_cut":0,"cells_raw":0,"read":"whole","date_system":"1900"}

{"sheet":"Auswahl Zukunftsbetrag","index":0,"n_rows":40,"n_cols":4,"rows_kept":40,"cut":false,"hidden":false,"merged":[[17,0,17,1],[18,0,18,1],[32,0,32,1],[18,3,39,3],[36,0,36,1],[39,0,39,1],[38,0,38,1],[35,0,35,1],[31,0,31,1],[19,0,19,1],[20,0,20,1],[33,0,33,1]]}
["Tariflicher Zukunftsbetrag"]
[]
["Gesellschaft",null,null,"<--- Zum Starten eine Gesellschaft auswählen"]
[{"$f":"CONCATENATE(\"Eintritt vor \",IF(Hilfsvariablen!E13=\"Ja\",TEXT(Hilfsvariablen!E16,\"TT.MM.JJJJ\"),\"Stichtag\"))","v":"Eintritt vor Stichtag"},"Ja"]
["Mitarbeitergruppe","Tariflich"]
["Tarifgruppe","E01"]
["Tariftyp","-"]
["Tarifstufe","-"]
["Bundesland","Bayern"]
[{"$f":"CONCATENATE(\"Beschäftigungsgrad am \",IF(Hilfsvariablen!E13=\"Ja\",TEXT(Hilfsvariablen!E15,\"TT.MM.JJJJ\"),\"Stichtag\"),\" ( = tatsächl. Arbeitszeit)\")","v":"Beschäftigungsgrad am Stichtag ( = tatsächl. Arbeitszeit)"},1]
[{"$f":"CONCATENATE(\"Anzahl regelmäßige Wochenarbeitstage \",Hilfsvariablen!E14)","v":"Anzahl regelmäßige Wochenarbeitstage 2025"},5]
["Beschäftigungsverhältnis","unbefristet"]
[{"$f":"CONCATENATE(\"Elternzeit, Krankheit, Altersteilzeit, Freistellung Langzeitkonto \",IF(Hilfsvariablen!E13=\"Ja\", CONCATENATE(\"in 1/\",Hilfsvariablen!E14),\"am Stichtag\"),\"?\")","v":"Elternzeit, Krankheit, Altersteilzeit, Freistellung Langzeitkonto am Stichtag?"},"Nein"]
[{"$f":"CONCATENATE(\"ohne Entgeltanspruch am \",IF(Hilfsvariablen!E13=\"Ja\",TEXT(Hilfsvariablen!E15,\"TT.MM.JJJJ\"),\"Stichtag\"),\" (z.B. Elternzeit, Krankheit, …)\")","v":"ohne Entgeltanspruch am Stichtag (z.B. Elternzeit, Krankheit, …)"},"Nein"]
[{"$f":"CONCATENATE(\"Altersteilzeit aktiv/passiv am \",IF(Hilfsvariablen!E13=\"Ja\",TEXT(Hilfsvariablen!E15,\"TT.MM.JJJJ\"),\"Stichtag\"))","v":"Altersteilzeit aktiv/passiv am Stichtag"},"Nein"]
[{"$f":"CONCATENATE(\"In Freistellung aus dem Langzeitkonto am \",IF(Hilfsvariablen!E13=\"Ja\",TEXT(Hilfsvariablen!E15,\"TT.MM.JJJJ\"),\"Stichtag\"))","v":"In Freistellung aus dem Langzeitkonto am Stichtag"},"Nein"]
[]
[{"$f":"CONCATENATE(\"Ergebnis Zukunftsbetrag (auf Basis der zum 01.04.\",Hilfsvariablen!E14,\" geltenden Tariftabelle)\")","v":"Ergebnis Zukunftsbetrag (auf Basis der zum 01.04.2025 geltenden Tariftabelle)"},null,null,"Hinweise zur Nutzung"]
[{"$f":"Hilfsvariablen!B16","v":"Bitte wählen Sie eine Gesellschaft aus und füllen das Formular anschließend von oben nach unten aus!"},null,null,"- Zur vereinfachten Bearbeitung ist ein Makro notwendig, hierfür im Dialog <Makros aktivieren> klicken oder im gelben Menüband <Inhalt aktivieren> klicken\n\n- Das Formular ist von oben nach unten auszufüllen, da einige Auswahlmöglichkeiten voneinander abhängen\n\n- Ändert man nachträglich einen Eintrag, so sind alle folgenden Auswahlmöglichkeiten erneut auf gültige Werte zu prüfen (falls erforderlich: Button \"Formular komplett zurücksetzen\" nutzen)"]
[]
{"$rows_left_out":21}
{"sheet":"Datenbasis1","index":1,"n_rows":501,"n_cols":48,"rows_kept":501,"cut":false,"hidden":true,"merged":[]}
["Gesellschaften","PassenderTarifvertrag",null,"Mitarbeitergruppe",null,"Tarifgruppe",null,null,null,null,null,"Tariftyp",null,null,null,null,"Bundesland",null,"Beschäftigungsverhältnis",null,"Ja/Nein",null,"ATZ",null,"Wochenarbeitstage",null,"Verwendungsmöglichkeiten",null,"PlusCard Tarife",null,null,"PlusCard Tarife Familienangehörige",null,null,null,"Alter Familienangehörige",null,null,null,null,"PlusCard Tariftabelle Familienangehörige",null,null,null,null,null,"Anzahl Freistellungstage"]
["Fresenius Medical Care AG","Ja",null,"Tariflich",null,"E01","-",null,null,null,null,"E01","-",null,null,null,"Bayern",null,"unbefristet",null,"Ja",null,"Nein",null,5,null,"Auszahlung",null,"select",12.67,null,"comfort","select",null,null,"Ehepartner","-","19 - 67 Jahre","ab 68 Jahren",null,{"$f":"CONCATENATE(AP2,\"_\",AQ2,\"_\",AR2)","v":"Ehepartner_-_comfort"},"Ehepartner","-","comfort",0,null,"1 Tag Freistellung",1]
["Fresenius Medical Care Deutschland GmbH","Ja",null,"Außertariflich",null,"E02","-",null,null,null,null,"E02","-",null,null,null,"anderes Bundesland",null,"befristet",null,"Nein",null,"Aktivphase",null,4,null,"Freistellung",null,"premium",16.48,null,"comfort","select","premium",null,"Kind","-","0 - 18 Jahre","19 - 25 Jahre",null,{"$f":"CONCATENATE(AP3,\"_\",AQ3,\"_\",AR3)","v":"Ehepartner_19 - 67 Jahre_comfort"},"Ehepartner","19 - 67 Jahre","comfort",6.38,null,"2 Tage Freistellung",2]
["Fresenius Medical Care GmbH","Ja",null,"Leitende Angestellte/Leitender Angestellter",null,"E03","-",null,null,null,null,"E03","-",null,null,null,null,null,null,null,null,null,"Passivphase",null,3,null,"Freistellung & Auszahlung",null,"prevent",70.010000000000005,null,"comfort","select","premium","prevent",null,null,null,null,null,"Ehepartner_ab 68 Jahren_comfort","Ehepartner","ab 68 Jahren","comfort",8.2899999999999991,null,"3 Tage Freistellung",3]
["ProCure Medical GmbH","Ja",null,"Auszubildende/Auszubildender",null,"E04","-",null,null,null,null,"E04","-",null,null,null,null,null,null,null,null,null,null,null,2,null,"Freistellung & Langzeitkonto",null,null,null,null,null,null,null,null,null,null,null,null,null,"Kind_-_comfort","Kind","-","comfort",0,null,"4 Tage Freistellung",4]
[null,null,null,"Duale Studentin/Dualer Student",null,"E05","A, bzw. 1","B, bzw. 2","C, bzw. 3",null,null,"E05","-",null,null,null,null,null,null,null,null,null,null,null,1,null,"Freistellung & PlusCard",null,null,null,null,null,null,null,null,null,null,null,null,null,"Kind_0 - 18 Jahre_comfort","Kind","0 - 18 Jahre","comfort",2.46,null,"5 Tage Freistellung",5]
[null,null,null,"Mini-Job",null,"E06","A, bzw. 1","B, bzw. 2","C, bzw. 3","D, bzw. 4",null,"E06","-",null,null,null,null,null,null,null,null,null,null,null,4.99,null,"Langzeitkonto",null,null,null,null,null,null,null,null,null,null,null,null,null,"Kind_19 - 25 Jahre_comfort","Kind","19 - 25 Jahre","comfort",6.38,null,"0 Tage Freistellung",0]
[null,null,null,"Midi-Job",null,"E07","A, bzw. 1","B, bzw. 2","C, bzw. 3","D, bzw. 4",null,"E07","-",null,null,null,null,null,null,null,null,null,null,null,4.9800000000000004,null,"Langzeitkonto & PlusCard",null,null,null,null,null,null,null,null,null,null,null,null,null,"Ehepartner_-_select","Ehepartner","-","select",0]
[null,null,null,null,null,"E08","A, bzw. 1","B, bzw. 2","C, bzw. 3","D, bzw. 4",null,"E08","-",null,null,null,null,null,null,null,null,null,null,null,4.97,null,"PlusCard",null,null,null,null,null,null,null,null,null,null,null,null,null,"Ehepartner_19 - 67 Jahre_select","Ehepartner","19 - 67 Jahre","select",22.97]
[null,null,null,null,null,"E09","A, bzw. 1","B, bzw. 2","C, bzw. 3","D, bzw. 4",null,"E09","kaufmännische Tätigkeit","technische Tätigkeit","Meister-Tätigkeit",null,null,null,null,null,null,null,null,null,4.96,null,null,null,null,null,null,null,null,null,null,null,null,null,null,null,"Ehepartner_ab 68 Jahren_select","Ehepartner","ab 68 Jahren","select",29.86]
[null,null,null,null,null,"E10","A, bzw. 1","B, bzw. 2","C, bzw. 3","D, bzw. 4",null,"E10","kaufmännische Tätigkeit","technische Tätigkeit","Meister-Tätigkeit",null,null,null,null,null,null,null,null,null,4.95,null,null,null,null,null,null,null,null,null,null,null,null,null,null,null,"Kind_-_select","Kind","-","select",0]
[null,null,null,null,null,"E11","A, bzw. 1","B, bzw. 2","C, bzw. 3","D, bzw. 4",null,"E11","kaufmännische Tätigkeit","technische Tätigkeit","Meister-Tätigkeit",null,null,null,null,null,null,null,null,null,4.9400000000000004,null,null,null,null,null,null,null,null,null,null,null,null,null,null,null,"Kind_0 - 18 Jahre_select","Kind","0 - 18 Jahre","select",8.84]
[null,null,null,null,null,"E12","A, bzw. 1","B, bzw. 2","C, bzw. 3","D, bzw. 4",null,"E12","kaufmännische Tätigkeit","technische Tätigkeit","Meister-Tätigkeit",null,null,null,null,null,null,null,null,null,4.93,null,null,null,null,null,null,null,null,null,null,null,null,null,null,null,"Kind_19 - 25 Jahre_select","Kind","19 - 25 Jahre","select",22.97]
[null,null,null,null,null,"E13","-",null,null,null,null,"E13","kaufmännische Tätigkeit","technische Tätigkeit","Meister-Tätigkeit",null,null,null,null,null,null,null,null,null,4.92,null,null,null,null,null,null,null,null,null,null,null,null,null,null,null,"Ehepartner_-_premium","Ehepartner","-","premium",0]
[null,null,null,null,null,"Azubi","1. Jahr","2. Jahr","3. Jahr","4. Jahr",null,"Azubi","-",null,null,null,null,null,null,null,null,null,null,null,4.91,null,null,null,null,null,null,null,null,null,null,null,null,null,null,null,"Ehepartner_19 - 67 Jahre_premium","Ehepartner","19 - 67 Jahre","premium",27.92]
[null,null,null,null,null,null,null,null,null,null,null,null,null,null,null,null,null,null,null,null,null,null,null,null,4.9000000000000004,null,null,null,null,null,null,null,null,null,null,null,null,null,null,null,"Ehepartner_ab 68 Jahren_premium","Ehepartner","ab 68 Jahren","premium",36.299999999999997]
[null,null,null,null,null,null,null,null,null,null,null,null,null,null,null,null,null,null,null,null,null,null,null,null,4.8899999999999997,null,null,null,null,null,null,null,null,null,null,null,null,null,null,null,"Kind_-_premium","Kind","-","premium",0]
["Entgelttabellen",null,null,null,null,null,null,null,null,null,null,null,null,null,null,null,null,null,null,null,null,null,null,null,4.88,null,null,null,null,null,null,null,null,null,null,null,null,null,null,null,"Kind_0 - 18 Jahre_premium","Kind","0 - 18 Jahre","premium",10.74]
[{"$f":"CONCATENATE(B19,\"_\",C19,\"_\",D19,\"_\",E19,\"_\",F19)","v":"2025_anderes Bundesland_E01_-_-"},2025,"anderes Bundesland","E01","-","-",3113,null,null,null,null,null,null,null,null,null,null,null,null,null,null,null,null,null,4.87,null,null,null,null,null,null,null,null,null,null,null,null,null,null,null,"Kind_19 - 25 Jahre_premium","Kind","19 - 25 Jahre","premium",27.92]
[{"$f":"CONCATENATE(B20,\"_\",C20,\"_\",D20,\"_\",E20,\"_\",F20)","v":"2025_anderes Bundesland_E02_-_-"},2025,"anderes Bundesland","E02","-","-",3253,null,null,null,null,null,null,null,null,null,null,null,null,null,null,null,null,null,4.8600000000000003,null,null,null,null,null,null,null,null,null,null,null,null,null,null,null,"Ehepartner_-_prevent","Ehepartner","-","prevent",0]
{"$rows_left_out":482}
{"sheet":"Hilfsvariablen","index":2,"n_rows":44,"n_cols":6,"rows_kept":44,"cut":false,"hidden":true,"merged":[]}
["Entgeltschlüssel",{"$f":"CONCATENATE(E14,\"_\",'Auswahl Zukunftsbetrag'!B9,\"_\",'Auswahl Zukunftsbetrag'!B6,\"_\",'Auswahl Zukunftsbetrag'!B8,\"_\",'Auswahl Zukunftsbetrag'!B7)","v":"2025_Bayern_E01_-_-"}]
["Entgelt",{"$f":"VLOOKUP(B1,Entgelttabelle,7,FALSE)*'Auswahl Zukunftsbetrag'!B10","v":3080}]
["Zukunftsbetraganspruch in Prozent vom Gehalt",0.23,null,"PlusCard","Tarif/alter","Kosten"]
["Zukunftsbetrag",{"$f":"IF(B15=\"\",\"0\",B2*B3)","v":"0"},null,"Tarif",{"$f":"'Auswahl Zukunftsbetrag'!B23","v":"select"},{"$f":"VLOOKUP(Hilfsvariablen!E4,Datenbasis1!AC2:AD4,2,FALSE)","v":12.67}]
["max. Tage Freistellung",{"$f":"ROUNDDOWN('Auswahl Zukunftsbetrag'!B11,0)","v":5},{"$f":"IF(ROUNDDOWN('Auswahl Zukunftsbetrag'!B11,0)-IF(OR('Auswahl Zukunftsbetrag'!B22=\"Freistellung & Auszahlung\",'Auswahl Zukunftsbetrag'!B22=\"Freistellung & PlusCard\",'Auswahl Zukunftsbetrag'!B22=\"Freistellung & Langzeitkonto\"),1,0)<0,0,ROUNDDOWN('Auswahl Zukunftsbetrag'!B11,0)-IF(OR('Auswahl Zukunftsbetrag'!B22=\"Freistellung & Auszahlung\",'Auswahl Zukunftsbetrag'!B22=\"Freistellung & PlusCard\",'Auswahl Zukunftsbetrag'!B22=\"Freistellung & Langzeitkonto\"),1,0))","v":5},"FamilienTarif",{"$f":"'Auswahl Zukunftsbetrag'!B25","v":"comfort"},"-"]
["Wert 1 Tage Freitstellung",{"$f":"ROUND(B4/'Auswahl Zukunftsbetrag'!B11,2)","v":0},null,"Ehepartner",{"$f":"'Auswahl Zukunftsbetrag'!B26","v":"-"},{"$f":"IF('Auswahl Zukunftsbetrag'!B24=\"Ja\",VLOOKUP(\"Ehepartner_\"&E6&\"_\"&E$5,PlusCardTariftabelleFamilie,5,FALSE),0)","v":0}]
["Gewählte Tage Freistellung",{"$f":"VLOOKUP('Auswahl Zukunftsbetrag'!B30,Datenbasis1!AU2:AV7,2,FALSE)","v":1},null,"Kind1",{"$f":"'Auswahl Zukunftsbetrag'!B27","v":"-"},{"$f":"IF('Auswahl Zukunftsbetrag'!B24=\"Ja\",VLOOKUP(\"Kind_\"&E7&\"_\"&E$5,PlusCardTariftabelleFamilie,5,FALSE),0)","v":0}]
["Betrag Freistellung",{"$f":"IF(B5>0,ROUND(((B4/'Auswahl Zukunftsbetrag'!B11)*B7),2),0)","v":0},null,"Kind2",{"$f":"'Auswahl Zukunftsbetrag'!B28","v":"-"},{"$f":"IF('Auswahl Zukunftsbetrag'!B24=\"Ja\",VLOOKUP(\"Kind_\"&E8&\"_\"&E$5,PlusCardTariftabelleFamilie,5,FALSE),0)","v":0}]
["PassenderTarifvertrag",{"$f":"VLOOKUP('Auswahl Zukunftsbetrag'!$B$3,GesellschaftTarifvertrag,2,FALSE)","v":{"$error":"#N/A"}},null,"Kind3",{"$f":"'Auswahl Zukunftsbetrag'!B29","v":"-"},{"$f":"IF('Auswahl Zukunftsbetrag'!B24=\"Ja\",VLOOKUP(\"Kind_\"&E9&\"_\"&E$5,PlusCardTariftabelleFamilie,5,FALSE),0)","v":0}]
[{"$f":"CONCATENATE(\"Eintrittsdatum vor \",TEXT(Hilfsvariablen!E16,\"TT.MM.JJJJ\"))","v":"Eintrittsdatum vor 03.01.2025"},{"$f":"'Auswahl Zukunftsbetrag'!B4","v":"Ja"},null,"Summe",null,{"$f":"SUM(F4:F9)","v":12.67}]
["Langzeitkonto möglich",{"$f":"IF(OR($B$9=\"Nein\",$B$10=\"Nein\",'Auswahl Zukunftsbetrag'!$B$5<>\"Tariflich\",'Auswahl Zukunftsbetrag'!$B$12=\"befristet\",'Auswahl Zukunftsbetrag'!$B$14=\"Ja\",'Auswahl Zukunftsbetrag'!$B$15=\"Passivphase\",'Auswahl Zukunftsbetrag'!$B$15=\"Aktivphase\",'Auswahl Zukunftsbetrag'!$B$16=\"Ja\"),\"Nein\",\"Ja\")","v":{"$error":"#N/A"}}]
["Freistellung möglich",{"$f":"IF(OR($B$9=\"Nein\",$B$10=\"Nein\",'Auswahl Zukunftsbetrag'!$B$5<>\"Tariflich\",'Auswahl Zukunftsbetrag'!$B$14=\"Ja\",'Auswahl Zukunftsbetrag'!$B$15=\"Passivphase\",'Auswahl Zukunftsbetrag'!$B$16=\"Ja\",B5<1),\"Nein\",\"Ja\")","v":{"$error":"#N/A"}}]
["PlusCard möglich",{"$f":"IF(OR($B$9=\"Nein\",$B$10=\"Nein\",'Auswahl Zukunftsbetrag'!$B$5<>\"Tariflich\",'Auswahl Zukunftsbetrag'!$B$12=\"befristet\",'Auswahl Zukunftsbetrag'!$B$14=\"Ja\",'Auswahl Zukunftsbetrag'!$B$15=\"Passivphase\",'Auswahl Zukunftsbetrag'!$B$16=\"Ja\"),\"Nein\",\"Ja\")","v":{"$error":"#N/A"}},null,"Datum anzeigen?","Nein"]
["Auszahlung möglich",{"$f":"IF(OR($B$9=\"Nein\",$B$10=\"Nein\",AND('Auswahl Zukunftsbetrag'!$B$5<>\"Tariflich\",'Auswahl Zukunftsbetrag'!$B$5=\"Auszubildende/Auszubildender\",'Auswahl Zukunftsbetrag'!$B$5=\"Duale Studentin/Dualer Student\"),'Auswahl Zukunftsbetrag'!$B$14=\"Ja\",'Auswahl Zukunftsbetrag'!$B$15=\"Passivphase\",'Auswahl Zukunftsbetrag'!$B$16=\"Ja\"),\"Nein\",\"Ja\")","v":{"$error":"#N/A"}},null,"Jahr ",2025]
[{"$f":"CONCATENATE(\"Verwendungsmöglichkeiten \",E14)","v":"Verwendungsmöglichkeiten 2025"},{"$f":"IF(ISERROR(_xlfn.TEXTJOIN(\", \",TRUE,IF(B11=\"Ja\",\"Langzeitkonto\",\"\"),IF(B12=\"Ja\",\"Individuelle Freistellungstage\",\"\"),IF(B13=\"Ja\",\"Pluscard\",\"\"))),\"\",_xlfn.TEXTJOIN(\", \",TRUE,IF(B11=\"Ja\",\"Langzeitkonto\",\"\"),IF(B12=\"Ja\",\"Individuelle Freistellungstage\",\"\"),IF(B13=\"Ja\",\"Pluscard\",\"\")))","v":""},null,"1. Werktag",{"$f":"WORKDAY(DATE(E14,1,1),1)","v":"2025-01-02"}]
[{"$f":"CONCATENATE(\"Ergebnis Zukunftsbetrag \",E14)","v":"Ergebnis Zukunftsbetrag 2025"},{"$f":"IF('Auswahl Zukunftsbetrag'!B3=\"\",\"Bitte wählen Sie eine Gesellschaft aus und füllen das Formular anschließend von oben nach unten aus!\",IF(OR(ISERROR(Hilfsvariablen!B2),ISERROR(Hilfsvariablen!B4),ISERROR(Hilfsvariablen!B15)),\"Bitte Parameter prüfen, ungültige Kombination gefunden!\nHinweis: Das Formular ist von oben nach unten auszufüllen\",CONCATENATE(IF(Hilfsvariablen!B15=\"\",IF(AND(B14=\"Ja\",OR('Auswahl Zukunftsbetrag'!$B$5=\"Auszubildende/Auszubildender\",'Auswahl Zukunftsbetrag'!$B$5=\"Duale Studentin/Dualer Student\")),CONCATENATE(\"Auf Grund Ihrer Eingaben können Sie Ihren tariflichen Zukunftsbetrag \",IF(E13=\"Ja\",CONCATENATE(E14, \" \"),\"\"),\"für folgende Verwendungsmöglichkeiten einsetzen:\n\nAuszahlung gemäß Sonderregelung im Tarifvertrag\"),CONCATENATE(\"Auf Grund Ihrer Eingaben haben Sie keinen Anspruch auf den tariflichen Zukunftsbetrag\",IF(E13=\"Ja\",CONCATENATE(\" \",E14),\"\"),\"!\")),CONCATENATE(IF('Auswahl Zukunftsbetrag'!$B$5<>\"Außertariflich\",CONCATENATE(\"Ihr tariflicher Zukunftsbetrag \", IF(E13=\"Ja\",CONCATENATE(E14, \" \"),\"\"),\"beträgt gemäß Ihrer Eingaben\n\",TEXT(Hilfsvariablen!B4,\"0,00\"),\" € (brutto).\",\"\n\n\"),\"\"),\"Für einen Anspruch muss zum Stichtag \",IF(E13=\"Ja\",TEXT(Hilfsvariablen!E15,\"TT.MM.JJJJ\"),\"(= erster Werktag des Anspruchsjahres)\"),\" Entgelt oder\n Entgeltfortzahlung aus einem ungekündigten Anstellungsverhältnis bezogen werden.\")))))","v":"Bitte wählen Sie eine Gesellschaft aus und füllen das Formular anschließend von oben nach unten aus!"},null,"1 Tag nach 1. Werktag",{"$f":"E15+1","v":"2025-01-03"}]
["Hilfsergebnis",{"$f":"IF(OR(B16=\"Auf Grund Ihrer Eingaben haben Sie keinen Anspruch auf den tariflichen Zukunftsbetrag \"&E14&\"!\",B16=\"Bitte wählen Sie eine Gesellschaft aus und füllen das Formular anschließend von oben nach unten aus!\",B16=\"Bitte Parameter prüfen, ungültige Kombination gefunden!\nHinweis: Das Formular ist von oben nach unten auszufüllen\"),\"Kein Zukunftsbetrag\",IF(NOT(ISERROR(FIND(\"Sonderregelung\",B16,1))),\"Auszahlung gemäß Sonderregelung im Tarifvertrag\",\"\"))","v":"Kein Zukunftsbetrag"}]
[]
["Hinweistext","- Zur vereinfachten Bearbeitung ist ein Makro notwendig, hierfür im Dialog <Makros aktivieren> klicken oder im gelben Menüband <Inhalt aktivieren> klicken\n\n- Das Formular ist von oben nach unten auszufüllen, da einige Auswahlmöglichkeiten voneinander abhängen\n\n- Ändert man nachträglich einen Eintrag, so sind alle folgenden Auswahlmöglichkeiten erneut auf gültige Werte zu prüfen (falls erforderlich: Button \"Formular komplett zurücksetzen\" nutzen)"]
[null,null,"Restbetrag","PlusCard","Freistellung"]
{"$rows_left_out":24}